{"text_format":"1","workbook":"xlsx","n_sheets":4,"sheets":["Wksh 1 - Market Experience","Wksh 2 - Plan Product Info","Wksh 3 - Rating Areas","PlanTemplate"],"not_rendered":{"charts":0,"images":0,"macros":1,"external_links":0,"defined_names":24,"comments":0,"pivot_tables":0},"unopened":[],"bounds":{"document_bytes":16777216,"sheet_cells":100000,"rows_first":2000,"rows_last":500,"rows_between":2000,"halvings":0,"cell_chars":16384,"cell_head_chars":4096},"cells_cut":0,"cells_raw":0,"read":"whole","date_system":"1900"}

{"sheet":"Wksh 1 - Market Experience","index":0,"n_rows":50,"n_cols":11,"rows_kept":50,"cut":false,"hidden":false,"merged":[[29,3,29,6],[111,0,111,14],[49,1,49,16],[7,1,8,16],[21,3,21,4],[21,5,21,6],[13,1,13,3],[14,1,14,3],[15,1,15,3],[16,1,16,3],[17,1,17,3],[18,1,18,3]]}
["Press TAB and directional arrow keys to read through the document. If macros are disabled, press and hold the ALT key and press the F, then I, and then N key. After that, select the Enable All Content option by pressing enter. (note that you can also press the C key to select \"Enable All Content\")  Instructions can be found in cells K1 through K4. If screen reader fails to announce a cell after performing a dropdown selection, please press F2 and then ESC to force the screen reader to resume.","Unified Rate Review v6.0 [assistive technology users, please reference cell A1 for instructions]",null,null,null,null,null,null,null,null,"To add a product to Worksheet 2 - Plan Product Info, select the Add Product button or Ctrl + Shift + P."]
[null,null,null,null,null,null,null,null,null,null,"To add a plan to Worksheet 2 - Plan Product Info, select the Add Plan button or Ctrl + Shift + L."]
[null,"Company Legal Name:","Molina Healthcare of Kentucky, Inc.",null,null,null,null,null,null,null,"To validate, select the Validate button or Ctrl + Shift + I."]
[null,"HIOS Issuer ID:",73891,"State:","KY",null,null,null,null,null,"To finalize, select the Finalize button or Ctrl + Shift + F."]
[null,"Effective Date of Rate Change(s):",{"$f":"MAX('Wksh 2 - Plan Product Info'!E19:L19)","v":"2024-01-01"},"Market: ","Individual"]
[]
[]
[null,"Market Level Calculations (Same for all Plans)"]
[]
[]
[null,"Section I: Experience Period Data"]
[null,"Experience Period:",null,"2022-01-01","to",{"$f":"EDATE(D12,12)-1","v":"2022-12-31"}]
[null,null,null,null,"Total","PMPM"]
[null,"Allowed Claims",null,null,2254484.9055426102,{"$f":"E14/E19","v":402.44286068236528}]
[null,"Reinsurance",null,null,0,{"$f":"E15/E19","v":0}]
[null,"Incurred Claims in Experience Period",null,null,1887239.530266,{"$f":"E16/E19","v":336.88674228239915}]
[null,"Risk Adjustment",null,null,-697271.35,{"$f":"E17/E19","v":-124.46828811138879}]
[null,"Experience Period Premium",null,null,2795841.25,{"$f":"E18/E19","v":499.07912352731165}]
[null,"Experience Period Member Months",null,null,{"$f":"'Wksh 2 - Plan Product Info'!D33","v":5602}]
[]
[null,"Section II: Projections"]
[null,null,null,"Year 1 Trend",null,"Year 2 Trend"]
[null,"Benefit Category","Experience Period Index Rate PMPM","Cost","Utilization","Cost","Utilization","Trended EHB Allowed Claims PMPM"]
[null,"Inpatient Hospital",68.260000000000005,1.0249999999999999,1.0249999999999999,1.0149999999999999,1.0349999999999999,{"$f":"PRODUCT(C24:G24)","v":75.339096347812472}]
[null,"Outpatient Hospital",109.44,1.0249999999999999,1.0349999999999999,1.0149999999999999,1.0449999999999999,123.14665855799996]
[null,"Professional",130.84,1.02642128151305,1.0349999999999999,1.0074212815130501,1.0449999999999999,146.33019275027718]
[null,"Other Medical",6.63,1.0174212815130499,1.0349999999999999,1.0074212815130501,1.0449999999999999,7.3499114560796972]
[null,"Capitation",0.2,1.0580059059943201,1.0549999999999999,1.0580059059943201,1.0649999999999999,0.25154068955006509]
[null,"Prescription Drug",87.07,1.0449999999999999,1,1.0449999999999999,1,95.082616749999985]
[null,"Total",{"$f":"SUM(C24:C29)","v":402.43999999999994},null,null,null,null,{"$f":"SUM(H24:H29)","v":447.5000165517194}]
[]
[null,"Morbidity Adjustment",null,null,null,1]
[null,"Demographic Shift",null,null,null,1]
[null,"Plan Design Changes",null,null,null,1]
[null,"Other",null,null,null,1]
[null,"Adjusted Trended EHB Allowed Claims PMPM for",null,{"$f":"IF(C5<>\"\",C5,\"\")","v":"2024-01-01"},null,{"$f":"H30*PRODUCT(F32:F35)","v":447.5000165517194}]
[]
[null,"Manual EHB Allowed Claims PMPM",null,null,null,631.07217537105805]
[null,"Applied Credibility %",null,null,null,0]
[]
[null,null,null,null,null,null,"Projected Period Totals"]
[null,"Projected Index Rate for",null,{"$f":"IF(C5<>\"\",C5,\"\")","v":"2024-01-01"},null,{"$f":"ROUND(F39*F36+(1-F39)*F38,2)","v":631.07000000000005},{"$f":"F42*F48","v":13017711.960000001}]
[null,"Reinsurance",null,null,null,0,{"$f":"F43*F48","v":0}]
[null,"Risk Adjustment Payment/Charge",null,null,null,37.892888728752901,{"$f":"F44*F48","v":781654.50869671488}]
[null,"Exchange User Fees",null,null,null,0,{"$f":"F45*F46*F48","v":0}]
[null,"Market Adjusted Index Rate",null,null,null,{"$f":"(F42-F43-F44)/(1-F45)","v":593.1771112712471},{"$f":"F46*F48","v":12236057.451303285}]
[]
[null,"Projected Member Months",null,null,null,{"$f":"'Wksh 2 - Plan Product Info'!D73","v":20628}]
[]
[null,"Information Not Releasable to the Public Unless Authorized by Law:  This information has not been publically disclosed and may be privileged and confidential. It is for internal government use only and must not be disseminated, distributed, or copied to persons not authorized to receive the information.  Unauthorized disclosure may result in prosecution to the full extent of the law.  "]

{"sheet":"Wksh 2 - Plan Product Info","index":1,"n_rows":82,"n_cols":16,"rows_kept":82,"cut":false,"hidden":false,"merged":[[47,4,47,11],[58,4,58,11],[59,4,59,11],[60,4,60,11],[21,4,21,11],[6,2,7,21],[10,4,10,9],[9,4,9,9],[20,4,20,9],[10,10,10,11],[9,10,9,11],[20,10,20,11]]}
["Press TAB and directional arrow keys to read through the document. If macros are disabled, press and hold the ALT key and press the F, then I, and then N key. After that, select the Enable All Content option by pressing enter. (note that you can also press the C key to select \"Enable All Content\")  Instructions can be found in cells P1 through P6. If screen reader fails to announce a cell after performing a dropdown selection, please press F2 and then ESC to force the screen reader to resume.",null,"Product-Plan Data Collection [assistive technology users, please reference cell A1 for instructions]",null,null,null,null,null,null,null,null,null,null,null,null,"To add a product to Worksheet 2 - Plan Product Info, select the Add Product button or Ctrl + Shift + P."]
[null,null,null,null,null,null,null,null,null,null,null,null,null,null,null,"To add a plan to Worksheet 2 - Plan Product Info, select the Add Plan button or Ctrl + Shift + L."]
[null,null,"Company Legal Name:",{"$f":"IF('Wksh 1 - Market Experience'!C3<>\"\", 'Wksh 1 - Market Experience'!C3,\"\")","v":"Molina Healthcare of Kentucky, Inc."},null,null,null,null,null,null,null,null,null,null,null,"To validate, select the Validate button or Ctrl + Shift + I."]
[null,null,"HIOS Issuer ID:",{"$f":"IF('Wksh 1 - Market Experience'!C4<>\"\", 'Wksh 1 - Market Experience'!C4,\"\")","v":73891},"State:",{"$f":"IF('Wksh 1 - Market Experience'!E4<>\"\",'Wksh 1 - Market Experience'!E4,\"\")","v":"KY"},null,null,null,null,null,null,null,null,null,"To finalize, select the Finalize button or Ctrl + Shift + F."]
[null,null,"Effective Date of Rate Change(s):",{"$f":"IF('Wksh 1 - Market Experience'!C5<>\"\", 'Wksh 1 - Market Experience'!C5,\"\")","v":"2024-01-01"},"Market: ",{"$f":"IF('Wksh 1 - Market Experience'!E5<>\"\",'Wksh 1 - Market Experience'!E5,\"\")","v":"Individual"},null,null,null,null,null,null,null,null,null,"To remove a product, navigate to the corresponding Product Name/Product ID field and select the Remove Product button or Ctrl + Shift + Q."]
[null,null,null,null,null,null,null,null,null,null,null,null,null,null,null,"To remove a plan, navigate to the corresponding Plan Name/Plan ID field and select the Remove Plan button or Ctrl + Shift + A."]
[null,null,"Product/Plan Level Calculations"]
[]
[null,"Field #","Section I: General Product and Plan Information"]
[null,"1.1","Product Name",null,"Molina Healthcare",null,null,null,null,null,"Molina Healthcare +Vision"]
[null,"1.2","Product ID",null,"73891KY001",null,null,null,null,null,"73891KY002"]
[null,"1.3","Plan Name",null,"Gold 1","Silver 1","Silver 12 with first 4 PCP visits free","Constant Care Silver 4","Constant Care Silver 7","Constant Care Silver 2","Gold 1 with Adult Vision Services","Silver 1 with Adult Vision Services"]
[null,"1.4","Plan ID (Standard Component ID)",null,"73891KY0010001","73891KY0010002","73891KY0010009","73891KY0010004","73891KY0010007","73891KY0010008","73891KY0020001","73891KY0020002"]
[null,"1.5","Metal",null,"Gold","Silver","Silver","Silver","Silver","Silver","Gold","Silver"]
[null,"1.6","AV Metal Value",null,0.78359999999999996,0.70020000000000004,0.70230000000000004,0.69599999999999995,0.7,0.69499999999999995,0.78359999999999996,0.70020000000000004]
[null,"1.7","Plan Category",null,"Renewing","Renewing","Renewing","Terminated","Terminated","Terminated","Renewing","Renewing"]
[null,"1.8","Plan Type",null,"HMO","HMO","HMO","HMO","HMO","HMO","HMO","HMO"]
[null,"1.9","Exchange Plan?",null,"Yes","Yes","Yes","No","No","No","Yes","Yes"]
[null,"1.10","Effective Date of Proposed Rates",null,"2024-01-01","2024-01-01","2024-01-01","2024-01-01","2024-01-01","2024-01-01","2024-01-01","2024-01-01"]
[null,"1.11","Cumulative Rate Change %  (over 12 mos prior)",null,5.6832838570990002E-2,-2.5300998975185899E-2,-1.84150718479166E-2,0,0,0,5.6316646051689297E-2,-2.5378057875763301E-2]
[null,"1.12","Product Rate Increase %",null,{"$f":"IF(SUMPRODUCT((E16:J16=\"Renewing\")*((E14:J14=\"Platinum\")+(E14:J14=\"Gold\")+(E14:J14=\"Silver\")+(E14:J14=\"Bronze\")+(E14:J14=\"Catastrophic\")))=0, 0, ROUND(ROUND(SUMPRODUCT(1+E20:J20,E34:J34,E35:J35,--(E16:J16=\"Renewing\")*((E14:J14=\"Platinum\")+(E14:J14=\"Gold\")+(E14:J14=\"Silver\")+(E14:J14=\"Bronze\")+(E14:J14=\"Catastrophic\")))/SUMPRODUCT(E34:J34,E35:J35,--(E16:J16=\"Renewing\")*((E14:J14=\"Platinum\")+(E14:J14=\"Gold\")+(E14:J14=\"Silver\")+(E14:J14=\"Bronze\")+(E14:J14=\"Catastrophic\"))), 4)-1, 4))","v":-2.3199999999999998E-2},null,null,null,null,null,{"$f":"IF(SUMPRODUCT((K16:L16=\"Renewing\")*((K14:L14=\"Platinum\")+(K14:L14=\"Gold\")+(K14:L14=\"Silver\")+(K14:L14=\"Bronze\")+(K14:L14=\"Catastrophic\")))=0, 0, ROUND(ROUND(SUMPRODUCT(1+K20:L20,K34:L34,K35:L35,--(K16:L16=\"Renewing\")*((K14:L14=\"Platinum\")+(K14:L14=\"Gold\")+(K14:L14=\"Silver\")+(K14:L14=\"Bronze\")+(K14:L14=\"Catastrophic\")))/SUMPRODUCT(K34:L34,K35:L35,--(K16:L16=\"Renewing\")*((K14:L14=\"Platinum\")+(K14:L14=\"Gold\")+(K14:L14=\"Silver\")+(K14:L14=\"Bronze\")+(K14:L14=\"Catastrophic\"))), 4)-1, 4))","v":-1.8200000000000001E-2}]
[null,"1.13","Submission Level Rate Increase %",null,{"$f":"IF(SUMPRODUCT((E16:L16=\"Renewing\")*((E14:L14=\"Platinum\")+(E14:L14=\"Gold\")+(E14:L14=\"Silver\")+(E14:L14=\"Bronze\")+(E14:L14=\"Catastrophic\")))=0, 0, ROUND(ROUND(SUMPRODUCT(1+E20:L20,E34:L34,E35:L35,--(E16:L16=\"Renewing\")*((E14:L14=\"Platinum\")+(E14:L14=\"Gold\")+(E14:L14=\"Silver\")+(E14:L14=\"Bronze\")+(E14:L14=\"Catastrophic\")))/SUMPRODUCT(E34:L34,E35:L35,--(E16:L16=\"Renewing\")*((E14:L14=\"Platinum\")+(E14:L14=\"Gold\")+(E14:L14=\"Silver\")+(E14:L14=\"Bronze\")+(E14:L14=\"Catastrophic\"))), 4)-1, 4))","v":-2.24E-2}]
[]
["Worksheet 1 Totals",null,"Section II: Experience Period and Current Plan Level Information"]
[null,"2.1","Plan ID (Standard Component ID)","Total",{"$f":"E13","v":"73891KY0010001"},"73891KY0010002","73891KY0010009","73891KY0010004","73891KY0010007","73891KY0010008","73891KY0020001","73891KY0020002"]
[{"$f":"'Wksh 1 - Market Experience'!E14","v":2254484.9055426102},"2.2","Allowed Claims",{"$f":"SUM(E26:XFD26)","v":2254484.9055426097},{"$f":"12022.69776246","v":12022.69776246},{"$f":"243287.44502673","v":243287.44502673001},{"$f":"0","v":0},{"$f":"46455.0671879","v":46455.0671879},{"$f":"1372493.90236089","v":1372493.9023608901},{"$f":"238817.088705","v":238817.088705},{"$f":"108796.25486791","v":108796.25486791},{"$f":"232612.44963172","v":232612.44963172}]
[{"$f":"'Wksh 1 - Market Experience'!E15","v":0},"2.3","Reinsurance",{"$f":"SUM(E27:XFD27)","v":0},{"$f":"0","v":0},{"$f":"0","v":0},{"$f":"0","v":0},{"$f":"0","v":0},{"$f":"0","v":0},{"$f":"0","v":0},{"$f":"0","v":0},{"$f":"0","v":0}]
[null,"2.4","Member Cost Sharing",{"$f":"SUM(E28:XFD28)","v":367245.37527660996},{"$f":"4575.27025246","v":4575.2702524599999},{"$f":"48416.4209857298","v":48416.420985729797},{"$f":"0","v":0},{"$f":"12099.5255519","v":12099.5255519},{"$f":"201331.45320289","v":201331.45320289},{"$f":"46554.2394569999","v":46554.239456999901},{"$f":"22726.04100491","v":22726.041004909999},{"$f":"31542.4248217203","v":31542.424821720298}]
[null,"2.5","Cost Sharing Reduction",{"$f":"SUM(E29:XFD29)","v":0},{"$f":"0","v":0},{"$f":"0","v":0},{"$f":"0","v":0},{"$f":"0","v":0},{"$f":"0","v":0},{"$f":"0","v":0},{"$f":"0","v":0},{"$f":"0","v":0}]
[{"$f":"'Wksh 1 - Market Experience'!E16","v":1887239.530266},"2.6","Incurred Claims",{"$f":"D26-D27-D28-D29","v":1887239.5302659997},7447.4275100000004,194871.02404100023,0,34355.541636000002,1171162.4491580001,192262.8492480001,86070.213862999997,201070.02480999968]
[{"$f":"'Wksh 1 - Market Experience'!E17","v":-697271.35},"2.7","Risk Adjustment Transfer Amount",{"$f":"SUM(E31:XFD31)","v":-697271.35},{"$f":"11516.43","v":11516.43},{"$f":"-44143.25","v":-44143.25},{"$f":"0","v":0},{"$f":"-48139.59","v":-48139.59},{"$f":"-607444.79","v":-607444.79},{"$f":"92030.5","v":92030.5},{"$f":"4897.56","v":4897.5600000000004},{"$f":"-105988.21","v":-105988.21}]
[{"$f":"'Wksh 1 - Market Experience'!E18","v":2795841.25},"2.8","Premium",{"$f":"SUM(E32:XFD32)","v":2795841.25},{"$f":"12933.38","v":12933.38},{"$f":"263892.39","v":263892.39},{"$f":"0","v":0},{"$f":"87231.45","v":87231.45},{"$f":"1918556.48","v":1918556.48},{"$f":"147838.69","v":147838.69},{"$f":"82440.71","v":82440.710000000006},{"$f":"282948.15","v":282948.15000000002}]
[{"$f":"'Wksh 1 - Market Experience'!E19","v":5602},"2.9","Experience Period Member Months",{"$f":"SUM(E33:XFD33)","v":5602},{"$f":"28","v":28},{"$f":"497","v":497},{"$f":"0","v":0},{"$f":"201","v":201},{"$f":"3853","v":3853},{"$f":"296","v":296},{"$f":"162","v":162},{"$f":"565","v":565}]
[null,"2.10","Current Enrollment",{"$f":"SUM(E34:XFD34)","v":505},{"$f":"2","v":2},{"$f":"305","v":305},{"$f":"111","v":111},{"$f":"0","v":0},{"$f":"0","v":0},{"$f":"0","v":0},{"$f":"7","v":7},{"$f":"80","v":80}]
[null,"2.11","Current Premium PMPM",{"$f":"SUMPRODUCT(E35:XFD35,E34:XFD34)/D34","v":549.14924752475247},{"$f":"488.45","v":488.45},{"$f":"566.308229508197","v":566.30822950819697},{"$f":"541.722342342342","v":541.72234234234202},{"$f":"0","v":0},{"$f":"0","v":0},{"$f":"0","v":0},{"$f":"548.607142857143","v":548.607142857143},{"$f":"495.600375","v":495.60037499999999}]
[null,"2.12","Loss Ratio",{"$f":"D30/(D31+D32)","v":0.89929791248125679},0.3046006292073436,0.88678856281758467,{"$error":"#DIV/0!"},0.87884131468801951,0.89325910072390557,0.80153207357726974,0.98548109394655969,1.1362460046607141]
[null,null,"Per Member Per Month"]
[null,"2.13","Allowed Claims",{"$f":"D26/D33","v":402.44286068236516},429.38206294500003,489.51196182440646,{"$error":"#DIV/0!"},231.11973725323384,356.21435306537506,806.8144888682433,671.58182017228398,411.70345067561061]
[null,"2.14","Reinsurance",{"$f":"D27/D33","v":0},0,0,{"$error":"#DIV/0!"},0,0,0,0,0]
[null,"2.15","Member Cost Sharing",{"$f":"D28/D33","v":65.556118399966081},163.40250901642858,97.417346047746065,{"$error":"#DIV/0!"},60.196644536815924,52.253167195144044,157.27783600337804,140.28420373401235,55.827300569416458]
[null,"2.16","Cost Sharing Reduction",{"$f":"D29/D33","v":0},0,0,{"$error":"#DIV/0!"},0,0,0,0,0]
[null,"2.17","Incurred Claims",{"$f":"D30/D33","v":336.8867422823991},265.97955392857142,392.09461577666042,{"$error":"#DIV/0!"},170.92309271641793,303.96118587023102,649.53665286486523,531.29761643827158,355.87615010619413]
[null,"2.18","Risk Adjustment Transfer Amount",{"$f":"D31/D33","v":-124.46828811138879},411.30107142857145,-88.819416498993959,{"$error":"#DIV/0!"},-239.50044776119401,-157.65501946535167,310.91385135135135,30.231851851851854,-187.58975221238939]
[null,"2.19","Premium",{"$f":"D32/D33","v":499.07912352731165},461.90642857142853,530.97060362173045,{"$error":"#DIV/0!"},433.98731343283583,497.93835452893848,499.45503378378379,508.89327160493832,500.79318584070802]
[]
[null,null,"Section III: Plan Adjustment Factors"]
[null,"3.1","Plan ID (Standard Component ID)",null,{"$f":"E13","v":"73891KY0010001"},"73891KY0010002","73891KY0010009","73891KY0010004","73891KY0010007","73891KY0010008","73891KY0020001","73891KY0020002"]
[null,"3.2","Market Adjusted Index Rate",null,{"$f":"'Wksh 1 - Market Experience'!F46","v":593.1771112712471}]
[null,"3.3","AV and Cost Sharing Design of Plan",null,1.04602302662486,0.74330596610969801,0.72290712797412804,0,0,0,1.04602302662486,0.74315070598092303]
[null,"3.4","Provider Network Adjustment",null,1,1,1,0,0,0,1,1]
[null,"3.5","Benefits in Addition to EHB",null,1,1,1,0,0,0,1.0078165393081799,1.0110021830553]
[null,null,"Administrative Costs"]
[null,"3.6","Administrative Expense",null,0.10648912712365299,0.14328581018802999,0.14670172603315301,0,0,0,0.105755580629047,0.14198581701941401]
[null,"3.7","Taxes and Fees",null,1.92501940763092E-2,1.9477574494339699E-2,1.94986827113891E-2,0,0,0,1.9245661219141199E-2,1.94695413520698E-2]
[null,"3.8","Profit & Risk Load",null,0.03,0.03,0.03,0,0,0,0.03,0.03]
[null,"3.9","Catastrophic Adjustment",null,1,1,1,0,0,0,1,1]
[null,"3.10","Plan Adjusted Index Rate",null,{"$f":"($E$48*PRODUCT(E49:E51)*E56)/(1-SUM(E53:E55))","v":734.93523130608878},546.19931430407769,533.48118928416454,0,0,0,740.03292127649445,551.2002037746106]
[]
[null,"3.11","Age Calibration Factor",0.61568031874600604,{"$f":"IF(D59<>\"\", D59, \"\")","v":0.61568031874600604}]
[null,"3.12","Geographic Calibration Factor",1.0366706408723201,{"$f":"IF(D60<>\"\", D60, \"\")","v":1.0366706408723201}]
[null,"3.13","Tobacco Calibration Factor",1,{"$f":"IF(D61<>\"\", D61, \"\")","v":1}]
[null,"3.14","Calibrated Plan Adjusted Index Rate",null,{"$f":"E57*(PRODUCT($E$59:$E$61))","v":469.0780781777741},348.61592388277728,340.49848252435521,0,0,0,472.33171810766896,351.80778014723774]
[]
[null,null,"Section IV: Projected Plan Level Information"]
[null,"4.1","Plan ID (Standard Component ID)","Total",{"$f":"E13","v":"73891KY0010001"},"73891KY0010002","73891KY0010009","73891KY0010004","73891KY0010007","73891KY0010008","73891KY0020001","73891KY0020002"]
[null,"4.2","Allowed Claims",{"$f":"SUM(E66:XFD66)","v":13017756.833554121},{"$f":"408934.76964043","v":408934.76964042999},{"$f":"5490327.92572813","v":5490327.9257281302},{"$f":"5490327.92572814","v":5490327.9257281404},{"$f":"0","v":0},{"$f":"0","v":0},{"$f":"0","v":0},{"$f":"408934.76964043","v":408934.76964042999},{"$f":"1219231.44281699","v":1219231.44281699}]
[null,"4.3","Reinsurance",{"$f":"SUM(E67:XFD67)","v":0},{"$f":"0","v":0},{"$f":"0","v":0},{"$f":"0","v":0},{"$f":"0","v":0},{"$f":"0","v":0},{"$f":"0","v":0},{"$f":"0","v":0},{"$f":"0","v":0}]
[null,"4.4","Member Cost Sharing",{"$f":"SUM(E68:XFD68)","v":3206183.0596910035},{"$f":"91448.3317052063","v":91448.331705206307},{"$f":"1308930.87326794","v":1308930.87326794},{"$f":"1423682.59805243","v":1423682.59805243},{"$f":"0","v":0},{"$f":"0","v":0},{"$f":"0","v":0},{"$f":"91448.3317052063","v":91448.331705206307},{"$f":"290672.924960221","v":290672.92496022099}]
[null,"4.5","Cost Sharing Reduction",{"$f":"SUM(E69:XFD69)","v":0},{"$f":"0","v":0},{"$f":"0","v":0},{"$f":"0","v":0},{"$f":"0","v":0},{"$f":"0","v":0},{"$f":"0","v":0},{"$f":"0","v":0},{"$f":"0","v":0}]
[null,"4.6","Incurred Claims",{"$f":"D66-D67-D68-D69","v":9811573.7738631181},317486.43793522369,4181397.0524601899,4066645.3276757104,0,0,0,317486.43793522369,928558.51785676903]
[null,"4.7","Risk Adjustment Transfer Amount",{"$f":"SUM(E71:XFD71)","v":589138.43420261878},{"$f":"18506.9665194534","v":18506.966519453399},{"$f":"248473.161603778","v":248473.16160377799},{"$f":"248473.161603779","v":248473.16160377901},{"$f":"0","v":0},{"$f":"0","v":0},{"$f":"0","v":0},{"$f":"18506.9665194534","v":18506.966519453399},{"$f":"55178.1779561549","v":55178.177956154897}]
[null,"4.8","Premium",{"$f":"SUM(E72:XFD72)","v":11413960.485360483},{"$f":"476239.780120594","v":476239.78012059402},{"$f":"4751951.49839673","v":4751951.4983967301},{"$f":"4641303.40407942","v":4641303.4040794196},{"$f":"0","v":0},{"$f":"0","v":0},{"$f":"0","v":0},{"$f":"479543.09536147","v":479543.09536147001},{"$f":"1064922.70740227","v":1064922.7074022701}]
[null,"4.9","Projected Member Months",{"$f":"SUM(E73:XFD73)","v":20628},{"$f":"648","v":648},{"$f":"8700","v":8700},{"$f":"8700","v":8700},{"$f":"0","v":0},{"$f":"0","v":0},{"$f":"0","v":0},{"$f":"648","v":648},{"$f":"1932","v":1932}]
[null,"4.10","Loss Ratio",{"$f":"D70/(D71+D72)","v":0.81742005457206113},0.64171505945487439,0.83620838964100408,0.83166281179711121,{"$error":"#DIV/0!"},{"$error":"#DIV/0!"},{"$error":"#DIV/0!"},0.63745888663523576,0.82899543246020779]
[null,null,"Per Member Per Month"]
[null,"4.11","Allowed Claims",{"$f":"D66/D73","v":631.07217537105487},631.07217537103395,631.07217537104941,631.07217537105066,{"$error":"#DIV/0!"},{"$error":"#DIV/0!"},{"$error":"#DIV/0!"},631.07217537103395,631.07217537111285]
[null,"4.12","Reinsurance",{"$f":"D67/D73","v":0},0,0,0,{"$error":"#DIV/0!"},{"$error":"#DIV/0!"},{"$error":"#DIV/0!"},0,0]
[null,"4.13","Member Cost Sharing",{"$f":"D68/D73","v":155.4286920540529},141.12396868087393,150.45182451355632,163.6416779370609,{"$error":"#DIV/0!"},{"$error":"#DIV/0!"},{"$error":"#DIV/0!"},141.12396868087393,150.45182451357195]
[null,"4.14","Cost Sharing Reduction",{"$f":"D69/D73","v":0},0,0,0,{"$error":"#DIV/0!"},{"$error":"#DIV/0!"},{"$error":"#DIV/0!"},0,0]
[null,"4.15","Incurred Claims",{"$f":"D70/D73","v":475.64348331700205},489.94820669016002,480.62035085749307,467.43049743398973,{"$error":"#DIV/0!"},{"$error":"#DIV/0!"},{"$error":"#DIV/0!"},489.94820669016002,480.62035085754093]
[null,"4.16","Risk Adjustment Transfer Amount",{"$f":"D71/D73","v":28.560133517675915},28.560133517674998,28.560133517675631,28.560133517675748,{"$error":"#DIV/0!"},{"$error":"#DIV/0!"},{"$error":"#DIV/0!"},28.560133517674998,28.560133517678519]
[null,"4.17","Premium",{"$f":"D72/D73","v":553.32366130310663},734.93793228486732,546.20132165479652,533.48314989418611,{"$error":"#DIV/0!"},{"$error":"#DIV/0!"},{"$error":"#DIV/0!"},740.03564098992285,551.20222950428058]

{"sheet":"Wksh 3 - Rating Areas","index":2,"n_rows":8,"n_cols":3,"rows_kept":8,"cut":false,"hidden":false,"merged":[]}
["Rating Area Data Collection [assistive technology users, please reference cell A2 for instructions]",null,"Specify the total number of Rating Areas in your State by selecting the Create Rating Areas button or Ctrl + Shift + R."]
["Press TAB and directional arrow keys to read through the document. If macros are disabled, press and hold the ALT key and press the F, then I, and then N key. After that, select the Enable All Content option by pressing enter. (note that you can also press the C key to select \"Enable All Content\")  Instructions can be found in cells C1 through C4. If screen reader fails to announce a cell after performing a dropdown selection, please press F2 and then ESC to force the screen reader to resume.",null,"Select only the Rating Areas you are offering plans within and add a factor for each area."]
[null,null,"To validate, select the Validate button or Ctrl + Shift + I."]
[null,null,"To finalize, select the Finalize button or Ctrl + Shift + F."]
["Rating Area","Rating Factor"]
["Rating Area 3",0.93300000000000005]
["Rating Area 5",0.97799999999999998]
["Rating Area 6",1.206]

{"sheet":"PlanTemplate","index":3,"n_rows":82,"n_cols":15,"rows_kept":82,"cut":false,"hidden":true,"merged":[[4,6,4,8],[9,3,21,3],[46,3,50,3],[52,3,56,3]]}
["REBUILD",null,"Product-Plan Data Collection"]
[]
[null,null,"Company Legal Name:",{"$f":"IF('Wksh 1 - Market Experience'!C3<>\"\", 'Wksh 1 - Market Experience'!C3,\"\")","v":"Molina Healthcare of Kentucky, Inc."},null,null,null,null,null,null,null,null,null,"State:",{"$f":"IF('Wksh 1 - Market Experience'!E4=\"\",\"\",'Wksh 1 - Market Experience'!E4)","v":"KY"}]
[null,null,"HIOS Issuer ID:",{"$f":"IF('Wksh 1 - Market Experience'!C4<>\"\", 'Wksh 1 - Market Experience'!C4,\"\")","v":73891},null,null,null,null,null,null,null,null,null,"Market: ",{"$f":"IF('Wksh 1 - Market Experience'!E5=\"\",\"\",'Wksh 1 - Market Experience'!E5)","v":"Individual"}]
[null,null,"Effective Date of Rate Change(s):",{"$f":"IF('Wksh 1 - Market Experience'!#REF!<>\"\", 'Wksh 1 - Market Experience'!#REF!,\"\")","v":{"$error":"#REF!"}}]
[]
[null,null,"Product/Plan Level Calculations"]
[]
[null,"Field #","Section I: General Product and Plan Information"]
[null,"1.1","Product Name",null,null,null,null,null,null,null,"Rating Area 1","AL","New","Platinum","Yes"]
[null,"1.2","Product ID",null,null,null,null,null,null,null,"Rating Area 2","AK","Renewing","Gold","No"]
[null,"1.3","Plan Name",null,null,null,null,null,null,null,"Rating Area 3","AZ","Terminated","Silver"]
[null,"1.4","Plan ID (Standard Component ID)",null,null,null,null,null,null,null,"Rating Area 4","AR",null,"Bronze"]
[null,"1.5","Metal",null,null,null,null,null,null,null,"Rating Area 5","CA",null,"Catastrophic"]
[null,"1.6","AV Metal Value",null,null,null,null,null,null,null,"Rating Area 6","CO",null,"Not Applicable"]
[null,"1.7","Plan Category",null,null,null,null,null,null,null,null,"CT"]
[null,"1.8","Plan Type",null,null,null,null,null,null,null,null,"DC"]
[null,"1.9","Exchange Plan?",null,null,null,null,null,null,null,null,"DE"]
[null,"1.10","Effective Date of Proposed Rates",null,null,null,null,null,null,null,null,"FL"]
[null,"1.11","Cumulative Rate Change %  (over 12 mos prior)",null,null,null,null,null,null,null,null,"GA"]
[null,"1.12","Product Rate Increase %",null,null,null,null,null,null,null,null,"HI"]
[null,"1.13","Submission Level Rate Increase %",null,null,null,null,null,null,null,null,"ID"]
[null,null,null,null,null,null,null,null,null,null,null,"IL"]
[null,null,"Section II: Experience Period and Current Plan Level Information",null,null,null,null,null,null,null,null,"IN"]
[null,"2.1","Plan ID (Standard Component ID)","Total",{"$f":"IF(E13<>\"\",E13,\"\")","v":""},null,null,null,null,null,null,"IA"]
[null,"2.2","Allowed Claims",{"$f":"SUM(E26:XFD26)","v":0},null,null,null,null,null,null,null,"KS"]
[null,"2.3","Reinsurance",{"$f":"SUM(E27:XFD27)","v":0},null,null,null,null,null,null,null,"KY"]
[null,"2.4","Member Cost Sharing",{"$f":"SUM(E28:XFD28)","v":0},null,null,null,null,null,null,null,"LA"]
[null,"2.5","Cost Sharing Reduction",{"$f":"SUM(E29:XFD29)","v":0},null,null,null,null,null,null,null,"ME"]
[null,"2.6","Incurred Claims",{"$f":"D26-D27-D28-D29","v":0},{"$f":"E26-E27-E28-E29","v":0},null,null,null,null,null,null,"MD"]
[null,"2.7","Risk Adjustment Transfer Amount",{"$f":"SUM(E31:XFD31)","v":0},null,null,null,null,null,null,null,"MA"]
[null,"2.8","Premium",{"$f":"SUM(E32:XFD32)","v":0},null,null,null,null,null,null,null,"MI"]
[null,"2.9","Experience Period Member Months",{"$f":"SUM(E33:XFD33)","v":0},null,null,null,null,null,null,null,"MN"]
[null,"2.10","Current Enrollment",{"$f":"SUM(E34:XFD34)","v":0},null,null,null,null,null,null,null,"MS"]
[null,"2.11","Current Premium PMPM",{"$f":"SUMPRODUCT(E35:XFD35,E34:XFD34)/D34","v":{"$error":"#DIV/0!"}},null,null,null,null,null,null,null,"MO"]
[null,"2.12","Loss Ratio",{"$f":"D30/(D31+D32)","v":{"$error":"#DIV/0!"}},{"$f":"E30/(E31+E32)","v":{"$error":"#DIV/0!"}},null,null,null,null,null,null,"MT"]
[null,null,"Per Member Per Month",null,null,null,null,null,null,null,null,"NE"]
[null,"2.13","Allowed Claims",{"$f":"D26/D33","v":{"$error":"#DIV/0!"}},{"$f":"E26/E33","v":{"$error":"#DIV/0!"}},null,null,null,null,null,null,"NV"]
[null,"2.14","Reinsurance",{"$f":"D27/D33","v":{"$error":"#DIV/0!"}},{"$f":"E27/E33","v":{"$error":"#DIV/0!"}},null,null,null,null,null,null,"NH"]
[null,"2.15","Member Cost Sharing",{"$f":"D28/D33","v":{"$error":"#DIV/0!"}},{"$f":"E28/E33","v":{"$error":"#DIV/0!"}},null,null,null,null,null,null,"NJ"]
[null,"2.16","Cost Sharing Reduction",{"$f":"D29/D33","v":{"$error":"#DIV/0!"}},{"$f":"E29/E33","v":{"$error":"#DIV/0!"}},null,null,null,null,null,null,"NM"]
[null,"2.17","Incurred Claims",{"$f":"D30/D33","v":{"$error":"#DIV/0!"}},{"$f":"E30/E33","v":{"$error":"#DIV/0!"}},null,null,null,null,null,null,"NY"]
[null,"2.18","Risk Adjustment Transfer Amount",{"$f":"D31/D33","v":{"$error":"#DIV/0!"}},{"$f":"E31/E33","v":{"$error":"#DIV/0!"}},null,null,null,null,null,null,"NC"]
[null,"2.19","Premium",{"$f":"D32/D33","v":{"$error":"#DIV/0!"}},{"$f":"E32/E33","v":{"$error":"#DIV/0!"}},null,null,null,null,null,null,"ND"]
[null,null,null,null,null,null,null,null,null,null,null,"OH"]
[null,null,"Section III: Plan Adjustment Factors",null,null,null,null,null,null,null,null,"OK"]
[null,"3.1","Plan ID (Standard Component ID)",null,{"$f":"IF(E13<>\"\",E13,\"\")","v":""},null,null,null,null,null,null,"OR"]
[null,"3.2","Market Adjusted Index Rate",null,{"$f":"'Wksh 1 - Market Experience'!F46","v":593.1771112712471},null,null,null,null,null,null,"PA"]
[null,"3.3","AV and Cost Sharing Design of Plan",null,null,null,null,null,null,null,null,"RI"]
[null,"3.4","Provider Network Adjustment",null,null,null,null,null,null,null,null,"SC"]
[null,"3.5","Benefits in Addition to EHB",null,null,null,null,null,null,null,null,"SD"]
[null,null,"Administrative Costs",null,null,null,null,null,null,null,null,"TN"]
[null,"3.6","Administrative Expense",null,null,null,null,null,null,null,null,"TX"]
[null,"3.7","Taxes and Fees",null,null,null,null,null,null,null,null,"UT"]
[null,"3.8","Profit & Risk Load",null,null,null,null,null,null,null,null,"VT"]
[null,"3.9","Catastrophic Adjustment",null,null,null,null,null,null,null,null,"VA"]
[null,"3.10","Plan Adjusted Index Rate",null,{"$f":"($E$48*PRODUCT(E49:E51)*E56)/(1-SUM(E53:E55))","v":0},null,null,null,null,null,null,"WA"]
[null,null,null,null,null,null,null,null,null,null,null,"WV"]
[null,"3.11","Age Calibration Factor",null,{"$f":"IF(D59<>\"\", D59, \"\")","v":""},null,null,null,null,null,null,"WI"]
[null,"3.12","Geographic Calibration Factor",null,{"$f":"IF(D60<>\"\", D60, \"\")","v":""},null,null,null,null,null,null,"WY"]
[null,"3.13","Tobacco Calibration Factor",null,{"$f":"IF(D61<>\"\", D61, \"\")","v":""}]
[null,"3.14","Calibrated Plan Adjusted Index Rate",null,{"$f":"E57*(PRODUCT($E$59:$E$61))","v":0}]
[]
[null,null,"Section IV: Projected Plan Level Information"]
[null,"4.1","Plan ID (Standard Component ID)","Total",{"$f":"IF(E13<>\"\",E13,\"\")","v":""}]
[null,"4.2","Allowed Claims",{"$f":"SUM(E66:XFD66)","v":0}]
[null,"4.3","Reinsurance",{"$f":"SUM(E67:XFD67)","v":0}]
[null,"4.4","Member Cost Sharing",{"$f":"SUM(E68:XFD68)","v":0}]
[null,"4.5","Cost Sharing Reduction",{"$f":"SUM(E69:XFD69)","v":0}]
[null,"4.6","Incurred Claims",{"$f":"D66-D67-D68-D69","v":0},{"$f":"E66-E67-E68-E69","v":0}]
[null,"4.7","Risk Adjustment Transfer Amount",{"$f":"SUM(E71:XFD71)","v":0}]
[null,"4.8","Premium",{"$f":"SUM(E72:XFD72)","v":0}]
[null,"4.9","Projected Member Months",{"$f":"SUM(E73:XFD73)","v":0}]
[null,"4.10","Loss Ratio",{"$f":"D70/(D71+D72)","v":{"$error":"#DIV/0!"}},{"$f":"E70/(E71+E72)","v":{"$error":"#DIV/0!"}}]
[null,null,"Per Member Per Month"]
[null,"4.11","Allowed Claims",{"$f":"D66/D73","v":{"$error":"#DIV/0!"}},{"$f":"E66/E73","v":{"$error":"#DIV/0!"}}]
[null,"4.12","Reinsurance",{"$f":"D67/D73","v":{"$error":"#DIV/0!"}},{"$f":"E67/E73","v":{"$error":"#DIV/0!"}}]
[null,"4.13","Member Cost Sharing",{"$f":"D68/D73","v":{"$error":"#DIV/0!"}},{"$f":"E68/E73","v":{"$error":"#DIV/0!"}}]
[null,"4.14","Cost Sharing Reduction",{"$f":"D69/D73","v":{"$error":"#DIV/0!"}},{"$f":"E69/E73","v":{"$error":"#DIV/0!"}}]
[null,"4.15","Incurred Claims",{"$f":"D70/D73","v":{"$error":"#DIV/0!"}},{"$f":"E70/E73","v":{"$error":"#DIV/0!"}}]
[null,"4.16","Risk Adjustment Transfer Amount",{"$f":"D71/D73","v":{"$error":"#DIV/0!"}},{"$f":"E71/E73","v":{"$error":"#DIV/0!"}}]
[null,"4.17","Premium",{"$f":"D72/D73","v":{"$error":"#DIV/0!"}},{"$f":"E72/E73","v":{"$error":"#DIV/0!"}}]